文章 2024-08-13 来自:开发者社区

ESLint—— Failed to load config "standard" to extend from

前言 为了更好的规范开发,开启了ESLint. 内容 遇到了错误Failed to load config "standard" to extend from,解决方法如下 npm i --save-dev eslint-plugin-promise npm i...

文章 2024-07-23 来自:开发者社区

error: Failed dependencies: mariadb-connector-c-config is obsoleted by mysql-community-server-8.0.36-1.el7.x86_64 问题解决

这个错误信息说明在尝试安装 mysql-community-server-8.0.36-1.el7.x86_64 时,遇到了一个依赖冲突:mariadb-connector-c-config 被标记为已废弃,并且与您正尝试安装的 MySQL Server 版本冲突。 解决这个问题通常涉及以下几个步骤: 移除冲突的包:如果 ma...

文章 2024-04-12 来自:开发者社区

ESLint—— Failed to load config “standard“ to extend from

一、前言 今天安装了javascript代码检测工具:eslint 版本 7.32.0 为了更好的规范开发,开启了ESLint 生成配置的时候始终没有node_modules文件夹,还报错 二、解决 ...

ESLint—— Failed to load config “standard“ to extend from
文章 2024-01-29 来自:开发者社区

记录一个Flutter运行的异常FAILURE: Build failed with an exception. What went wrong: A problem occurred config

异常内容运行一个Flutter项目时提示:Launching lib\main.dart on 21091116C in debug mode…Warning: Observed package id ‘build-tools;30.0.3’ in inconsistent location ‘D:\Android\android-sdk\build-tools\30.0.3-2’ (Expec....

阿里云文档 2023-04-18

使用DTS同步数据到AnalyticDBMySQL提示Getinc_checkpointconfigfromMetafailed_云原生数据仓库AnalyticDB MySQL版(AnalyticDB for MySQL)

问题描述使用DTS同步数据到AnalyticDB MySQL,提示Get inc_checkpoint config from Meta failed或者Read timed out报错。Get inc_checkpoint config from Meta failedRead timed out...

文章 2017-12-11 来自:开发者社区

AC-50207: Fatal: Failed to execute one or more of the config tools during Contex

Oracle EBS R12.1.3  .   cd  $COMMON_TOP/clone/bin   perl  adcfgclone.pl  appsTier  报错 :    Beginning application tier Apply -...

文章 2017-02-27 来自:开发者社区

Initialization failed for Block pool (Datanode Uuid unassigned) service to IP1:8020 Invalid volume failure config value: 1

2017-02-27 16:19:44,739 ERROR datanode.DataNode: Initialization failed for Block pool <registering> (Datanode Uuid unassigned) service to IP1:8020 Invalid volume failure  config value: 1201...

文章 2016-03-22 来自:开发者社区

configure: error: GD build test failed. Please check the config.log

Linux 源代码包配置PHP时出错:configure: error: GD build test failed. Please check the config.log Ps: 正确解答此问题者,追加200分!不够的还可以增加!谢谢啊! 无语啊。。。本来已经搭建好的源码环境,结果由于PHP版本太高,无法用Zend ZendOptimizer。我就把PHP5.6.4给卸载了,然后想装...

问答 2016-01-29 来自:开发者社区

服务器提示Failed to query Postfix config command to get the current value of parameter virtual_alias_maps:

Linux服务器安装WebMin提示Failed to query Postfix config command to get the current value of parameter virtual_alias_maps: 怎么办

本页面内关键词为智能算法引擎基于机器学习所生成,如有任何问题,可在页面下方点击"联系我们"与我们沟通。

产品推荐